{"text_format":"1","workbook":"xlsx","n_sheets":8,"sheets":["Calculator NL","Calculateur FR","Products","Portefeuille NL","Portefeuille FR","Gebruiksaanwijzing","Mode d'emploi","DEVELOPMENT TAB"],"not_rendered":{"charts":0,"images":18,"macros":1,"external_links":0,"defined_names":5,"comments":0,"pivot_tables":0},"unopened":[],"bounds":{"document_bytes":16777216,"sheet_cells":100000,"rows_first":2000,"rows_last":500,"rows_between":2000,"halvings":0,"cell_chars":16384,"cell_head_chars":4096},"cells_cut":0,"cells_raw":0,"read":"whole","date_system":"1900"}

{"sheet":"Calculator NL","index":0,"n_rows":48,"n_cols":10,"rows_kept":48,"cut":false,"hidden":false,"merged":[[7,8,7,9],[6,8,6,9],[6,6,6,7],[7,6,7,7],[44,3,44,7],[9,4,9,7],[47,1,47,9],[46,1,46,9],[38,4,38,5],[39,4,39,5],[40,4,40,5],[41,4,41,5],[42,4,42,5],[4,4,4,5],[34,4,34,5],[35,4,35,5],[36,4,36,5],[37,4,37,5],[32,3,32,6],[6,3,6,5],[7,3,7,5],[26,3,26,6]]}
[]
[]
[]
[]
[null,null,null,"Naam gebruiker","Stomagebruiker 1"]
[]
[null,null,null,"TYPE",null,null,"PERIODE",null,"SOORT STOMA"]
[{"$f":"_xlfn.CONCAT(D8,G8,I8,)","v":"Convex/ConcaafOpvolgfaseColostoma"},null,null,"Convex/Concaaf",null,null,"Opvolgfase",null,"Colostoma"]
[]
[null,null,null,"Keuze:",{"$f":"_xlfn.IFNA(IF(VLOOKUP(A8,'Portefeuille NL'!A:H,8,FALSE)=0,\"\",(VLOOKUP(A8,'Portefeuille NL'!A:H,8,FALSE))),\"GEEN GELDIGE KEUZE\")","v":"655550 - Colostoma - opvolgfase - Convex/Concaaf"}]
[null,null,null,"Portefeuille waarde",null,null,{"$f":"_xlfn.IFNA(VLOOKUP(A8,'Portefeuille NL'!A:H,7,FALSE),\"0\")","v":810.47}]
[null,null,null,"Reeds gespendeerd bedrag"]
[]
[null,null,null,"Artikelnummer","Lijstnummer","ID-nummer","Aantal eenheden","Artikelomschrijving","Aantal/doos","Publieksprijs incl. btw"]
[null,null,null,"62140J",{"$f":"_xlfn.IFNA(VLOOKUP(D15,Products!A:F,6,FALSE),\"\")","v":"906009"},{"$f":"_xlfn.IFNA(VLOOKUP(D15,Products!A:G,7,FALSE),\"\")","v":"906009000023"},"10",{"$f":"_xlfn.IFNA(VLOOKUP(D15,Products!A:E,2,FALSE),\"\")","v":"FLEXIMA KEY COLO BGE 40"},{"$f":"_xlfn.IFNA(VLOOKUP(D15,Products!A:E,3,FALSE),\"\")","v":30},{"$f":"_xlfn.IFNA(VLOOKUP(D15,Products!A:E,5,FALSE) / I15 *G15,\"\")","v":19.504000000000005}]
[null,null,null,null,{"$f":"_xlfn.IFNA(VLOOKUP(D16,Products!A:F,6,FALSE),\"\")","v":""},{"$f":"_xlfn.IFNA(VLOOKUP(D16,Products!A:G,7,FALSE),\"\")","v":""},null,{"$f":"_xlfn.IFNA(VLOOKUP(D16,Products!A:E,2,FALSE),\"\")","v":""},{"$f":"_xlfn.IFNA(VLOOKUP(D16,Products!A:E,3,FALSE),\"\")","v":""},{"$f":"_xlfn.IFNA(VLOOKUP(D16,Products!A:E,5,FALSE) / I16 *G16,\"\")","v":""}]
[null,null,null,"044040J",{"$f":"_xlfn.IFNA(VLOOKUP(D17,Products!A:F,6,FALSE),\"\")","v":"906001"},{"$f":"_xlfn.IFNA(VLOOKUP(D17,Products!A:G,7,FALSE),\"\")","v":"906001000055"},"5",{"$f":"_xlfn.IFNA(VLOOKUP(D17,Products!A:E,2,FALSE),\"\")","v":"FLEXIMA COLO BEIGE 40MM SCG"},{"$f":"_xlfn.IFNA(VLOOKUP(D17,Products!A:E,3,FALSE),\"\")","v":30},{"$f":"_xlfn.IFNA(VLOOKUP(D17,Products!A:E,5,FALSE) / I17 *G17,\"\")","v":16.271000000000001}]
[null,null,null,null,{"$f":"_xlfn.IFNA(VLOOKUP(D18,Products!A:F,6,FALSE),\"\")","v":""},{"$f":"_xlfn.IFNA(VLOOKUP(D18,Products!A:G,7,FALSE),\"\")","v":""},null,{"$f":"_xlfn.IFNA(VLOOKUP(D18,Products!A:E,2,FALSE),\"\")","v":""},{"$f":"_xlfn.IFNA(VLOOKUP(D18,Products!A:E,3,FALSE),\"\")","v":""},{"$f":"_xlfn.IFNA(VLOOKUP(D18,Products!A:E,5,FALSE) / I18 *G18,\"\")","v":""}]
[null,null,null,null,{"$f":"_xlfn.IFNA(VLOOKUP(D19,Products!A:F,6,FALSE),\"\")","v":""},{"$f":"_xlfn.IFNA(VLOOKUP(D19,Products!A:G,7,FALSE),\"\")","v":""},null,{"$f":"_xlfn.IFNA(VLOOKUP(D19,Products!A:E,2,FALSE),\"\")","v":""},{"$f":"_xlfn.IFNA(VLOOKUP(D19,Products!A:E,3,FALSE),\"\")","v":""},{"$f":"_xlfn.IFNA(VLOOKUP(D19,Products!A:E,5,FALSE) / I19 *G19,\"\")","v":""}]
[null,null,null,null,{"$f":"_xlfn.IFNA(VLOOKUP(D20,Products!A:F,6,FALSE),\"\")","v":""},{"$f":"_xlfn.IFNA(VLOOKUP(D20,Products!A:G,7,FALSE),\"\")","v":""},null,{"$f":"_xlfn.IFNA(VLOOKUP(D20,Products!A:E,2,FALSE),\"\")","v":""},{"$f":"_xlfn.IFNA(VLOOKUP(D20,Products!A:E,3,FALSE),\"\")","v":""},{"$f":"_xlfn.IFNA(VLOOKUP(D20,Products!A:E,5,FALSE) / I20 *G20,\"\")","v":""}]
{"$rows_left_out":29}
{"sheet":"Calculateur FR","index":1,"n_rows":47,"n_cols":10,"rows_kept":47,"cut":false,"hidden":false,"merged":[[34,4,34,5],[46,1,46,9],[45,1,45,7],[35,7,35,8],[36,7,36,8],[37,7,37,8],[38,7,38,8],[39,7,39,8],[40,7,40,8],[43,3,43,5],[41,7,41,8],[35,4,35,5],[36,4,36,5],[37,4,37,5],[38,4,38,5],[4,6,4,7],[9,4,9,7],[39,4,39,5],[40,4,40,5],[41,4,41,5],[6,3,6,5],[7,3,7,5],[24,3,24,8],[33,7,33,8],[34,7,34,8],[31,3,31,4],[6,8,6,9],[7,8,7,9],[6,6,6,7],[7,6,7,7],[33,4,33,5]]}
[]
[]
[]
[null,null,"  "]
[null,null,null,"Nom de l'utilisateur"]
[]
[null,null,null,"TYPE",null,null,"PÉRIODE",null,"TYPE DE STOMIE"]
[{"$f":"_xlfn.CONCAT(D8,G8,I8,)","v":"Dispositifs de stomiePhase d'apprentissageColostomie"},null,null,"Dispositifs de stomie",null,null,"Phase d'apprentissage",null,"Colostomie"]
[]
[null,null,null,"Choix:",{"$f":"_xlfn.IFNA(IF(VLOOKUP(A8,'Portefeuille FR'!A:H,8,FALSE)=0,\"\",(VLOOKUP(A8,'Portefeuille FR'!A:H,8,FALSE))),\"choix invalide \")","v":"655336 - Colostomie - Phase d'apprentissage - Dispositifs de stomie"}]
[null,null,null,"Valeur du portefeuille",null,null,{"$f":"_xlfn.IFNA(VLOOKUP(A8,'Portefeuille FR'!A:H,7,FALSE),\"0\")","v":769.9}]
[null,null,null,"Montant déjà dépensé",null,null,0]
[]
[null,null,null,"Numéro d'article ","Numéro de liste","Numéro d'identification","Quantité de boîtes ","Description ","Quantité/boîte ","Prix ​​public TVA incl."]
[null,null,null,"621240J",{"$f":"_xlfn.IFNA(VLOOKUP(D15,Products!A:F,6,FALSE),\"\")","v":"906010"},{"$f":"_xlfn.IFNA(VLOOKUP(D15,Products!A:G,7,FALSE),\"\")","v":"906010000043"},"30",{"$f":"_xlfn.IFNA(VLOOKUP(D15,Products!A:E,2,FALSE),\"\")","v":"FLEXIMA KEY ROLL'UP DRAIN. POUCH TRSP 40"},{"$f":"_xlfn.IFNA(VLOOKUP(D15,Products!A:E,3,FALSE),\"\")","v":30},{"$f":"_xlfn.IFNA(VLOOKUP(D15,Products!A:E,5,FALSE) / I15 *G15,\"\")","v":57.377800000000008}]
[null,null,null,null,{"$f":"_xlfn.IFNA(VLOOKUP(D16,Products!A:F,6,FALSE),\"\")","v":""},{"$f":"_xlfn.IFNA(VLOOKUP(D16,Products!A:G,7,FALSE),\"\")","v":""},null,{"$f":"_xlfn.IFNA(VLOOKUP(D16,Products!A:E,2,FALSE),\"\")","v":""},{"$f":"_xlfn.IFNA(VLOOKUP(D16,Products!A:E,3,FALSE),\"\")","v":""},{"$f":"_xlfn.IFNA(VLOOKUP(D16,Products!A:E,5,FALSE) / I16 *G16,\"\")","v":""}]
[null,null,null,null,{"$f":"_xlfn.IFNA(VLOOKUP(D17,Products!A:F,6,FALSE),\"\")","v":""},{"$f":"_xlfn.IFNA(VLOOKUP(D17,Products!A:G,7,FALSE),\"\")","v":""},null,{"$f":"_xlfn.IFNA(VLOOKUP(D17,Products!A:E,2,FALSE),\"\")","v":""},{"$f":"_xlfn.IFNA(VLOOKUP(D17,Products!A:E,3,FALSE),\"\")","v":""},{"$f":"_xlfn.IFNA(VLOOKUP(D17,Products!A:E,5,FALSE) / I17 *G17,\"\")","v":""}]
[null,null,null,null,{"$f":"_xlfn.IFNA(VLOOKUP(D18,Products!A:F,6,FALSE),\"\")","v":""},{"$f":"_xlfn.IFNA(VLOOKUP(D18,Products!A:G,7,FALSE),\"\")","v":""},null,{"$f":"_xlfn.IFNA(VLOOKUP(D18,Products!A:E,2,FALSE),\"\")","v":""},{"$f":"_xlfn.IFNA(VLOOKUP(D18,Products!A:E,3,FALSE),\"\")","v":""},{"$f":"_xlfn.IFNA(VLOOKUP(D18,Products!A:E,5,FALSE) / I18 *G18,\"\")","v":""}]
[null,null,null,null,{"$f":"_xlfn.IFNA(VLOOKUP(D19,Products!A:F,6,FALSE),\"\")","v":""},{"$f":"_xlfn.IFNA(VLOOKUP(D19,Products!A:G,7,FALSE),\"\")","v":""},null,{"$f":"_xlfn.IFNA(VLOOKUP(D19,Products!A:E,2,FALSE),\"\")","v":""},{"$f":"_xlfn.IFNA(VLOOKUP(D19,Products!A:E,3,FALSE),\"\")","v":""},{"$f":"_xlfn.IFNA(VLOOKUP(D19,Products!A:E,5,FALSE) / I19 *G19,\"\")","v":""}]
[null,null,null,null,{"$f":"_xlfn.IFNA(VLOOKUP(D20,Products!A:F,6,FALSE),\"\")","v":""},{"$f":"_xlfn.IFNA(VLOOKUP(D20,Products!A:G,7,FALSE),\"\")","v":""},null,{"$f":"_xlfn.IFNA(VLOOKUP(D20,Products!A:E,2,FALSE),\"\")","v":""},{"$f":"_xlfn.IFNA(VLOOKUP(D20,Products!A:E,3,FALSE),\"\")","v":""},{"$f":"_xlfn.IFNA(VLOOKUP(D20,Products!A:E,5,FALSE) / I20 *G20,\"\")","v":""}]
{"$rows_left_out":28}
{"sheet":"Products","index":2,"n_rows":174,"n_cols":7,"rows_kept":174,"cut":false,"hidden":false,"merged":[[1,0,1,6],[162,0,162,4]]}
["Artikelnummer Numéro d'article","Artikelomschrijving                          \nDescription","Besteleenheid/doos                         Unité de commande/boîte","Eenheid        Unité","Publieksprijs/doos incl.BTW  \nPrix ​​public/boîte TVA incl.","Lijstnummer  Numéro de liste","ID-nummer           Numéro d'indentification"]
["TERUGBETAALDE PRODUCTEN/PRODUITS REMBOURSÉS"]
["044015J","FLEXIMA COLO BEIGE 15-60 SCG",30,"PC",97.626000000000005,"906001","906001000055"]
["044025J","FLEXIMA COLO BEIGE 25MM SCG",30,"PC",97.626000000000005,"906001","906001000055"]
["044030J","FLEXIMA COLO BEIGE 30MM SCG",30,"PC",97.626000000000005,"906001","906001000055"]
["044035J","FLEXIMA COLO BEIGE 35MM SCG",30,"PC",97.626000000000005,"906001","906001000055"]
["044040J","FLEXIMA COLO BEIGE 40MM SCG",30,"PC",97.626000000000005,"906001","906001000055"]
["044070J","FLEXIMA COLO BEIGE 15-75 SCG",30,"PC",97.626000000000005,"906001","906001000055"]
["044615J","FLEXIMA COLO TRANSP. 15-60 SCG",30,"PC",97.626000000000005,"906001","906001000055"]
["044670J","FLEXIMA COLO TRANSP. 15-75 SCG",30,"PC",97.626000000000005,"906001","906001000055"]
["4612115J","FLEXIMA ACTIVE CLOSED FLAT SC MIDI 15-50",30,"PC",97.626000000000005,"906001","906001000046"]
["4622115J","FLEXIMA ACTIVE ROLL UP MIDI SC CTF 15-50",30,"PC",133.24200000000002,"906002","906002000066"]
["4622215J","FLEXIMA ACTIVE ROLL UP MINI SC CTF 15-45",30,"PC",133.24200000000002,"906002","906002000075"]
["4622380J","FLEXIMA ACTIVE ROLL UP MAXI SC CTF 15-65",30,"PC",133.24200000000002,"906002","906002000057"]
["60530J","IRYSLEEVES 50 MM",30,"PC",56.603999999999999,"906021","906021000026"]
["621250J","FLEXIMA KEY ROLL'UP DRAIN. POUCH TRSP 50",30,"PC",57.24,"906010","906010000043"]
["621251J","FLEXIMA KEY ROLL'UP DRAIN. POUCH BEIGE 5",30,"PC",57.24,"906010","906010000043"]
["621260J","FLEXIMA KEY ROLL'UP DRAIN. POUCH TRSP 60",30,"PC",57.24,"906010","906010000043"]
["621261J","FLEXIMA KEY ROLL'UP DRAIN. POUCH BEIGE 6",30,"PC",57.24,"906010","906010000043"]
["621280J","FLEXIMA KEY ROLL'UP DRAIN. POUCH TRSP 80",30,"PC",57.24,"906010","906010000043"]
{"$rows_left_out":155}
{"sheet":"Portefeuille NL","index":3,"n_rows":30,"n_cols":8,"rows_kept":30,"cut":false,"hidden":false,"merged":[]}
[null,"1. Maximale verzekeringstegemoetkomingen voor stomahulpmiddelen"]
[null,"Soort stoma","Prestatie","Type","Periode","Leerfase of opvolgfase","Bedrag in € voor 2021"]
[{"$f":"_xlfn.CONCAT(D3,E3,B3)","v":"StomahulpmiddelenleerfaseColostoma"},"Colostoma",655336,"Stomahulpmiddelen","leerfase","gedurende de éérste drie maanden",769.9,{"$f":"_xlfn.CONCAT(C3, \" - \",B3,\" - \",E3,\" - \",D3)","v":"655336 - Colostoma - leerfase - Stomahulpmiddelen"}]
[{"$f":"_xlfn.CONCAT(D4,E4,B4)","v":"StomahulpmiddelenopvolgfaseColostoma"},"Colostoma",655351,"Stomahulpmiddelen","opvolgfase","vanaf de 4de maand",627.13,{"$f":"_xlfn.CONCAT(C4, \" - \",B4,\" - \",E4,\" - \",D4)","v":"655351 - Colostoma - opvolgfase - Stomahulpmiddelen"}]
["StomahulpmiddelenleerfaseIleostoma","Ileostoma",655373,"Stomahulpmiddelen","leerfase","gedurende de éérste drie maanden",673.13,"655373 - Ileostoma - leerfase - Stomahulpmiddelen"]
["StomahulpmiddelenopvolgfaseIleostoma","Ileostoma",655432,"Stomahulpmiddelen","opvolgfase","vanaf de 4de maand",530.36,"655432 - Ileostoma - opvolgfase - Stomahulpmiddelen"]
["StomahulpmiddelenleerfaseUrostoma","Urostoma",655454,"Stomahulpmiddelen","leerfase","gedurende de éérste drie maanden",747.97,"655454 - Urostoma - leerfase - Stomahulpmiddelen"]
["StomahulpmiddelenopvolgfaseUrostoma","Urostoma",655476,"Stomahulpmiddelen","opvolgfase","vanaf de 4de maand",605.20000000000005,"655476 - Urostoma - opvolgfase - Stomahulpmiddelen"]
[null,"2. Maximale verzekeringstegemoetkomingen voor stomahulpmiddelen bij gebruik van convexe/concave systemen"]
[null,"Soort stoma","Prestatie","Type","Periode","Leerfase of opvolgfase","Bedrag in € voor 2021"]
[{"$f":"_xlfn.CONCAT(D11,E11,B11)","v":"Convex/ConcaafleerfaseColostoma"},"Colostoma",655491,"Convex/Concaaf","leerfase","gedurende de éérste drie maanden",953.24,"655491 - Colostoma - leerfase - Convex/Concaaf"]
["Convex/ConcaafopvolgfaseColostoma","Colostoma",655550,"Convex/Concaaf","opvolgfase","vanaf de 4de maand",810.47,"655550 - Colostoma - opvolgfase - Convex/Concaaf"]
["Convex/ConcaafleerfaseIleostoma","Ileostoma",655572,"Convex/Concaaf","leerfase","gedurende de éérste drie maanden",856.48,"655572 - Ileostoma - leerfase - Convex/Concaaf"]
["Convex/ConcaafopvolgfaseIleostoma","Ileostoma",655594,"Convex/Concaaf","opvolgfase","vanaf de 4de maand",713.7,"655594 - Ileostoma - opvolgfase - Convex/Concaaf"]
["Convex/ConcaafleerfaseUrostoma","Urostoma",655631,"Convex/Concaaf","leerfase","gedurende de éérste drie maanden",931.31,"655631 - Urostoma - leerfase - Convex/Concaaf"]
["Convex/ConcaafopvolgfaseUrostoma","Urostoma",655653,"Convex/Concaaf","opvolgfase","vanaf de 4de maand",788.54,"655653 - Urostoma - opvolgfase - Convex/Concaaf"]
[null,"3. Maximale verzekeringstegemoetkomingen voor stomahulpmiddelen in geval van uitzonderlijke toestand"]
[null,"Soort stoma","Prestatie","Type","Periode","Leerfase of opvolgfase","Bedrag in € voor 2021"]
[{"$f":"_xlfn.CONCAT(D19,E19,B19)","v":"Uitzonderlijke toestandopvolgfaseColostoma"},"Colostoma",655675,"Uitzonderlijke toestand","opvolgfase","vanaf de 4de maand",877.3,"655675 - Colostoma - opvolgfase - Uitzonderlijke toestand"]
[{"$f":"_xlfn.CONCAT(D20,E20,B20)","v":"Uitzonderlijke toestandopvolgfaseIleostoma"},"Ileostoma",655896,"Uitzonderlijke toestand","opvolgfase","vanaf de 4de maand",780.53,"655896 - Ileostoma - opvolgfase - Uitzonderlijke toestand"]
{"$rows_left_out":11}
{"sheet":"Portefeuille FR","index":4,"n_rows":29,"n_cols":8,"rows_kept":29,"cut":false,"hidden":false,"merged":[]}
[null,"1. Interventions maximales de l’assurance pour des dispostifs de stomie"]
[null,"TYPES DE STOMIE","Prestation","Type","Phase","Phase d'apprentissage ou phase de suivi","Montant en € pour 2021"]
[{"$f":"_xlfn.CONCAT(D3,E3,B3)","v":"Dispositifs de stomiePhase d'apprentissageColostomie"},"Colostomie",655336,"Dispositifs de stomie","Phase d'apprentissage","au cours des trois premiers mois",769.9,{"$f":"_xlfn.CONCAT(C3, \" - \",B3,\" - \",E3,\" - \",D3)","v":"655336 - Colostomie - Phase d'apprentissage - Dispositifs de stomie"}]
["Dispositifs de stomiePhase de suiviColostomie","Colostomie",655351,"Dispositifs de stomie","Phase de suivi","à partir du 4ème mois",627.13,{"$f":"_xlfn.CONCAT(C4, \" - \",B4,\" - \",E4,\" - \",D4)","v":"655351 - Colostomie - Phase de suivi - Dispositifs de stomie"}]
["Dispositifs de stomiePhase d'apprentissageIléostomie","Iléostomie",655373,"Dispositifs de stomie","Phase d'apprentissage","au cours des trois premiers mois",673.13,"655373 - Iléostomie - Phase d'apprentissage - Dispositifs de stomie"]
["Dispositifs de stomiePhase de suiviIléostomie","Iléostomie",655432,"Dispositifs de stomie","Phase de suivi","à partir du 4ème mois",530.36,"655432 - Iléostomie - Phase de suivi - Dispositifs de stomie"]
["Dispositifs de stomiePhase d'apprentissageUrostomie","Urostomie",655454,"Dispositifs de stomie","Phase d'apprentissage","au cours des trois premiers mois",747.97,"655454 - Urostomie - Phase d'apprentissage - Dispositifs de stomie"]
[null,"2. Interventions maximales de l’assurance pour des dispostifs de stomie en cas d’utilisation de systèmes convexes/concaves"]
[null,"Types de stomie","Prestation","Type","Phase","Phase d'apprentissage ou phase de suivi","Montant en € pour 2021"]
[{"$f":"_xlfn.CONCAT(D10,E10,B10)","v":"Convexes/ConcavesPhase d'apprentissageColostomie"},"Colostomie",655491,"Convexes/Concaves","Phase d'apprentissage","au cours des trois premiers mois",953.24,"655491 - Colostomie - Phase d'apprentissage - Convexes/Concaves"]
["Convexes/ConcavesPhase de suiviColostomie","Colostomie",655550,"Convexes/Concaves","Phase de suivi","à partir du 4ème mois",810.47,"655550 - Colostomie - Phase de suivi - Convexes/Concaves"]
["Convexes/ConcavesPhase d'apprentissageIléostomie","Iléostomie",655572,"Convexes/Concaves","Phase d'apprentissage","au cours des trois premiers mois",856.48,"655572 - Iléostomie - Phase d'apprentissage - Convexes/Concaves"]
["Convexes/ConcavesPhase de suiviIléostomie","Iléostomie",655594,"Convexes/Concaves","Phase de suivi","à partir du 4ème mois",713.7,"655594 - Iléostomie - Phase de suivi - Convexes/Concaves"]
["Convexes/ConcavesPhase d'apprentissageUrostomie","Urostomie",655631,"Convexes/Concaves","Phase d'apprentissage","au cours des trois premiers mois",931.31,"655631 - Urostomie - Phase d'apprentissage - Convexes/Concaves"]
["Convexes/ConcavesPhase de suiviUrostomie","Urostomie",655653,"Convexes/Concaves","Phase de suivi","à partir du 4ème mois",788.54,"655653 - Urostomie - Phase de suivi - Convexes/Concaves"]
[null,"3. Interventions maximales de l’assurance pour des dispostifs de stomie en cas de situation exceptionnelle"]
[null,"Types de stomie","Prestation","Type","Phase","Phase d'apprentissage ou phase de suivi","Montant en € pour 2021"]
[{"$f":"_xlfn.CONCAT(D18,E18,B18)","v":"Situation exceptionnellePhase de suiviColostomie"},"Colostomie",655675,"Situation exceptionnelle","Phase de suivi","à partir du 4ème mois",877.3,"655675 - Colostomie - Phase de suivi - Situation exceptionnelle"]
[{"$f":"_xlfn.CONCAT(D19,E19,B19)","v":"Situation exceptionnellePhase de suiviIléostomie"},"Iléostomie",655896,"Situation exceptionnelle","Phase de suivi","à partir du 4ème mois",780.53,"655896 - Iléostomie - Phase de suivi - Situation exceptionnelle"]
[{"$f":"_xlfn.CONCAT(D20,E20,B20)","v":"Situation exceptionnellePhase de suiviUrostomie"},"Urostomie",655911,"Situation exceptionnelle","Phase de suivi","à partir du 4ème mois",855.37,"655911 - Urostomie - Phase de suivi - Situation exceptionnelle"]
{"$rows_left_out":10}
{"sheet":"Gebruiksaanwijzing","index":5,"n_rows":67,"n_cols":13,"rows_kept":67,"cut":false,"hidden":false,"merged":[[29,0,29,1],[6,0,7,17],[32,0,32,17],[13,0,13,15],[24,0,24,15],[8,0,8,1],[12,0,12,1],[20,0,20,1],[31,0,31,15],[25,0,25,17],[22,0,22,17],[36,0,36,15],[38,0,38,15],[60,0,61,15],[66,0,66,15],[59,0,59,1],[64,0,64,1]]}
[]
[]
[]
[]
[]
[]
["Deze gebruiksaanwijzing legt uit hoe je de B. Braun Stoma Calculator eenvoudig en optimaal kan gebruiken voor het beheren van het forfaitaire bedrag voor stomamateriaal."]
[]
["Stap 1"]
[]
["Maak de berekening die je wilt uitvoeren persoonlijker door de naam van de stomagebruiker in te vullen:"]
[]
["Stap 2"]
["Duid in het lichtpaarse menu aan welke situatie voor jou(w gebruiker) van toepassing is:"]
[]
[null,"1. Het type materiaal dat je nodig hebt",null,null,null,null,"2. In welke fase je (jouw gebruiker zich) bevindt",null,null,null,null,null,"3. Welke stoma van toepassing is"]
[]
[]
[]
[]
{"$rows_left_out":48}
{"sheet":"Mode d'emploi","index":6,"n_rows":67,"n_cols":13,"rows_kept":67,"cut":false,"hidden":false,"merged":[[6,0,7,17],[13,0,13,15],[12,0,12,2],[20,0,20,2],[66,0,66,15],[22,0,22,17],[24,0,24,15],[25,0,25,17],[31,0,31,15],[32,0,32,17],[29,0,29,2],[36,0,36,15],[38,0,38,15],[59,0,59,1],[60,0,61,15],[64,0,64,1]]}
[]
[]
[]
[]
[]
[]
["Ce guide de l'utilisateur explique comment utiliser le calculateur de stomie B. Braun de manière simple et optimale pour gérer le montant forfaitaire pour le matériel de stomie."]
[]
["Première étape"]
[]
["Rendez le calcul souhaité plus personnel en saisissant le nom de l'utilisateur de stomie :"]
[]
["Deuxième étape"]
["Indiquez dans le menu violet clair quelle situation s'applique à vous: "]
[]
[null,"1. Le type de matériel dont vous avez besoin",null,null,null,null,"2. Dans quelle phase vous (votre utilisateur) se trouve-t-il ?",null,null,null,null,null,"3. Quelle stomie est applicable"]
[]
[]
[]
[]
{"$rows_left_out":48}
{"sheet":"DEVELOPMENT TAB","index":7,"n_rows":18,"n_cols":3,"rows_kept":18,"cut":false,"hidden":true,"merged":[]}
["TYPE",null,"TYPE"]
["Stomahulpmiddelen",null,"Dispositifs de stomie"]
["Convex/Concaaf",null,"Convexes/Concaves"]
["Uitzonderlijke toestand",null,"Situation exceptionnelle"]
["Uitzonderlijke toestand & convex/concaaf",null,"Situation exceptionnelle et d’utilisation de systèmes convexes/concaves"]
["Irrigatie",null,"Irrigation"]
[]
["PERIODE",null,"INDICATION DE TEMPS"]
["Leerfase",null,"Phase d'apprentissage"]
["Opvolgfase",null,"Phase de suivi"]
["Irrigatie 6M",null,"Irrigation 6M"]
["Irrigatie 36M",null,"Irrigation 36M"]
[]
["SOORT STOMA",null,"SORTE DE STOMIE"]
["Colostoma",null,"Colostomie"]
["Ileostoma",null,"iléostomie"]
["Urostoma",null,"Urostomie"]
["Irrigatie",null,"Irrigation"]